{"text_format":"3","workbook":"xlsx","n_sheets":20,"sheets":["Pegue aqui la DB","MENU","Application","Back","Bar Code","Rights Ingles","Rights Espanol","Milk Espanol","Milk Ingles","Religious English","Religious Espanol","Temp Ingles","Temp Espanol","Form H1509","WL Ingles","WL Espanol","VOUCHER","Veteran-Disabled","Instructions","Sites"],"not_rendered":{"images":49,"macros":1,"defined_names":23},"read":"whole","date_system":"1900"}

{"sheet":"Pegue aqui la DB","index":0,"n_rows":2,"n_cols":33,"rows_kept":2}
["Client No.","Last Name","First Name","Middle Name","Site Name","DOB","Address","Apt  or Unit","Zip Code","City","State","County","Phone","Gender","Household Members","Monthly Income","Client Status","Certification Start Date","Certification End Date","Ethnicity","Race","Income Eligibility","Proxy 1","Proxy Phone","Proxy 2","Notes","Veteran","Disabled","Receive Texts","Home Delivery","Check to order a Card","Modified Date","Modified By"]
[50002,"Sample","John","Fitzgerald","163","1954-05-24","123 Main St.","Apt. 1","78041","Laredo","TX","Webb","9564800492","Male",{"v":5,"d":"5.00"},{"v":1200,"d":"$1,200.00"},"Active","2023-12-08","2024-04-30","Hispanic or Latino","White","Social Security","Gloria Calderon","","Annette Calderon","","No","Yes Other","No","No",0,"2023-05-31","Juan Solis"]

{"sheet":"MENU","index":1,"n_rows":148,"n_cols":21,"rows_kept":148,"hidden":true,"merged":[[0,1,0,19],[1,1,1,19],[4,0,4,19],[33,11,33,16],[34,11,34,16],[36,11,36,18],[37,11,37,18],[38,11,38,18],[40,11,40,18],[41,11,41,12],[41,13,41,18],[43,11,43,19],[44,11,44,19],[45,11,45,19],[46,11,46,19],[47,11,47,13],[49,11,49,13],[50,11,50,13],[53,11,53,12],[54,11,54,12],[55,11,55,12],[64,11,64,18],[65,11,65,12],[102,12,102,17],[104,11,104,12],[105,11,105,12],[106,11,106,12],[106,13,106,14],[106,15,106,16],[109,11,109,18],[110,11,110,18]]}
[null,"South Texas Food Bank",{"$nulls":18}," "]
[null,"Commodity Supplemental Food Program (CSFP)"]
[]
[]
["PRINTING MENU"]
[null," "]
{"$rows_empty":26}
[null,"Household Information "]
[null,"Name of Individual that is Filling the Application",{"$nulls":9},{"$f":"'Pegue aqui la DB'!AG2","v":"Juan Solis"}]
[null,"Title of Individual that is Filling the Application",{"$nulls":9},"Eligibility Specialist"]
[]
[null,"Name of Applicant",{"$nulls":7},"Last",null,{"$f":"'Pegue aqui la DB'!B2","v":"Sample"}]
[{"$nulls":9},"First",null,{"$f":"'Pegue aqui la DB'!C2","v":"John"}]
[{"$nulls":9},"(Full) Middle",null,{"$f":"'Pegue aqui la DB'!D2","v":"Fitzgerald"}]
[]
[null,"Site Name",{"$nulls":9},{"$f":"VLOOKUP('Pegue aqui la DB'!E2,Sites!A1:B180,2,FALSE)","v":"Holy Redeemer"}]
[null,"Date of Birth",{"$nulls":9},{"$f":"'Pegue aqui la DB'!F2","v":"1954-05-24"},null,{"$f":"IF(L42<1,\"\",IF(L105-L42>=21915,\"Age is Ok\",\"Warning not 60 years old yet !\"))","v":"Age is Ok"}]
[]
[null,"Address",{"$nulls":7},"Street",null,{"$f":"'Pegue aqui la DB'!G2","v":"123 Main St."}]
[{"$nulls":11},{"$f":"'Pegue aqui la DB'!H2","v":"Apt. 1"}]
[{"$nulls":9},"City",null,{"$f":"'Pegue aqui la DB'!J2","v":"Laredo"}]
[{"$nulls":9},"State",null,{"$f":"'Pegue aqui la DB'!K2","v":"TX"}]
[{"$nulls":9},"ZipCode",null,{"$f":"'Pegue aqui la DB'!I2","v":"78041"}]
[]
[null,"Area Code and Telephone No.",{"$nulls":9},{"$f":"'Pegue aqui la DB'!M2","v":"9564800492"}]
[null,"Alternate Telephone No."]
[null,"Total Number of Household Members",{"$nulls":9},{"$f":"'Pegue aqui la DB'!O2","v":5}]
[]
[null,"Total Gross Income of all Household Members:",{"$nulls":7},"Weekly"]
[{"$nulls":9},"Monthly",null,{"$f":"'Pegue aqui la DB'!P2","v":{"v":1200,"d":"$1,200"}},null,"Note: SNAP benefits do not count as income."]
{"$rows_left_out":75}
{"sheet":"Application","index":2,"n_rows":101,"n_cols":57,"rows_kept":101,"merged":[[0,28,0,32],[1,1,1,39],[2,1,2,39],[3,1,3,39],[5,34,5,38],[6,33,6,39],[9,1,9,6],[9,13,9,22],[9,24,9,37],[12,15,12,24],[12,25,12,29],[12,30,12,35],[14,10,14,39],[17,15,17,17],[18,14,18,18],[18,33,18,34],[19,1,19,3],[23,1,23,3],[25,21,25,26],[25,29,25,36],[26,1,26,3],[29,1,29,3],[33,1,33,3],[33,14,33,16],[33,29,33,32],[55,1,55,3],[67,12,67,13],[67,29,67,30],[70,2,70,3],[71,2,71,3],[72,2,72,3],[73,2,73,3],[74,2,74,3],[100,22,100,39]]}
[{"$nulls":28},{"$f":"'Pegue aqui la DB'!A2","v":50002}]
[null,"Commodity Supplemental Food Program"]
[null,"Participant Application"]
[null,"Print pages 1 – 2 for Certification."]
["Household Information"]
[null,"Name of applicant/Nombre del solicitante",{"$nulls":14},"      Address/Dirección",{"$nulls":17},"Date/Fecha"]
[null,{"$f":"MENU!L37&\", \"&MENU!L38&\" \"&MENU!L39","v":"Sample, John Fitzgerald"},{"$nulls":10},{"$f":"MENU!L44&\" \"&MENU!L45&\", \"&MENU!L46&\" \"&MENU!L47&\" \"&MENU!L48","v":"123 Main St. Apt. 1, Laredo TX 78041"},{"$nulls":20},{"$f":"'Pegue aqui la DB'!R2","v":"2023-12-08"}]
[]
[null,"Date of birth/La fecha de nacimiento",{"$nulls":10},"     Phone number/Número de teléfono",{"$nulls":11},"    Site name/Nombre del sitio"]
[null,{"$f":"IF(MENU!L42<=0, \" \",MENU!L42)","v":"1954-05-24"},{"$nulls":11},{"$f":"MENU!L50","v":"9564800492"},{"$nulls":10},{"$f":"MENU!L41","v":"Holy Redeemer"}]
[]
[null,"Name of proxy/Nombre del proxy",{"$nulls":10},"     Phone number/Número de teléfono",{"$nulls":11},"    Dates of proxy/Fechas de proxy"]
[null,{"$f":"MENU!L110","v":"Gloria Calderon"},{"$nulls":6},"/",{"$f":"MENU!L111","v":"Annette Calderon"},{"$nulls":5},{"$f":"'Pegue aqui la DB'!X2","v":""},{"$nulls":9},{"$f":"V26","v":"2023-12-08"},{"$nulls":4},{"$f":"AD26","v":"2026-11-01"}]
[]
["Income Information",{"$nulls":9},{"$f":"MENU!L65","v":0}]
[null,"Total gross income (before deductions) of all household members. SNAP benefits do not count as income."]
[null,"Ingreso brutos total (antes de deducciones) de todos los miembros del hogar. Beneficios de SNAP no cuentan como ingreso."]
[null,"$_________    Weekly/Semanal",{"$nulls":12},"$",{"$f":"IF(MENU!L55<=0,\" \",MENU!L55)","v":{"v":1200,"d":"1,200"}},null,null,"  Monthly/Mensual",{"$nulls":7},"  $_________    Yearly/Anual"]
[{"$nulls":14},{"$f":"IF(MENU!L54<=0,\" \",MENU!L54)","v":" "},{"$nulls":18},{"$f":"IF(MENU!L56<=0,\" \",MENU!L56)","v":" "}]
[null,{"$f":"MENU!L52","v":5},null,null,"Number of household members/Número de miembros del hogar"]
[]
["Eligibility"]
[]
[null,{"$f":"MENU!L103","v":"X"},null,null,"Eligible/Eligible    Applicant is eligible when they meet income, residency, and age requirements./El solicitante es elegible "]
[null,null,"cuando cumple con los requisitos de ingresos, residencia, y edad.",{"$nulls":48},"mas ","un año","menos"]
[{"$nulls":4},"Dates of certification/Fechas de la certificación:",{"$nulls":15},"from/de ",{"$f":"'Pegue aqui la DB'!R2","v":"2023-12-08"},{"$nulls":5}," to/a ",null,{"$f":"VALUE(BC26&\"/\"&BD26&\"/\"&BE26)","v":"2026-11-01"},{"$nulls":20},{"$f":"MONTH(V26)","v":12},11,{"$f":"AZ26+AY26","v":23},12,{"$f":"IF(BA26-BB26<=0,12,BA26-BB26)","v":11},1,{"$f":"IF(AY26=1,YEAR(V26)+2,YEAR(V26)+3)","v":2026}]
[null,{"$f":"MENU!L104","v":0},null,null,"Eligible and on waitlist/Eligible y en la lista de espera",{"$nulls":45},"today","11 mese","despues",12]
[]
[]
[null,{"$f":"MENU!L113","v":0},null,null,"Ineligible/Inelegible        I have been advised in writing that I am ineligible to participate in the CSFP and have the right to a fair "]
{"$rows_left_out":22}
{"sheet":"Back","index":3,"n_rows":105,"n_cols":31,"rows_kept":105,"hidden":true,"merged":[[0,1,0,3],[11,12,11,13],[11,29,11,30],[14,2,14,3],[15,2,15,3],[16,2,16,3],[17,2,17,3],[18,2,18,3],[44,19,44,29],[81,30,81,35],[83,30,83,35],[90,24,90,36],[92,24,92,36],[104,1,105,1],[104,30,104,36]]}
[null,{"$f":"Application!AC1","v":50002},null,null,{"$f":"Application!B7","v":"Sample, John Fitzgerald"}]
{"$rows_empty":8}
["Ethnicity and Race"]
[null,"Ethnicity  (select one category)/Origen étnico (seleccione una categoría)"]
[null,null," Hispanic or Latino/Hispano o Latino",{"$nulls":9},{"$f":"MENU!L76","v":"X"},{"$nulls":4},"Not Hispanic or Latino/No hispano o Latino",{"$nulls":11},{"$f":"MENU!L77","v":0}]
[]
[null,"Race  (select one or more categories)/Raza (seleccione una o más categorías)"]
[null,null,{"$f":"MENU!L69","v":0},null,"Black or African American/Negro o afroamericano"]
[null,null,{"$f":"MENU!L70","v":0},null,"Native Hawaiian or Other Pacific Islander/Nativo de Hawai o de otra isla del Pacífico"]
[null,null,{"$f":"MENU!L71","v":0},null,"American Indian or Alaskan Native/Indio americano o nativo de Alaska"]
[null,null,{"$f":"MENU!L72","v":0},null,"Asian/asiático"]
[null,null,{"$f":"MENU!L73","v":"X"},null,"White/el blanco"]
{"$rows_empty":23}
["Signatures"]
[null,"  Applicant or Proxy’s Signature/Firma del participante o representante",{"$nulls":17},"   CE or Site’s Signature/CE o firma del sitio"]
[null,"X",{"$nulls":17},{"$f":"MENU!L34","v":"Juan Solis"}]
{"$rows_empty":28}
[null,"Eligibility",{"$nulls":10}," Category",{"$nulls":11}," Determination"]
[]
[null,"Income",{"$nulls":3},{"$f":"MENU!L82","v":"X"},"Yes",null,{"$f":"MENU!L83","v":0},"No",{"$nulls":3},{"$f":"MENU!L99","v":"X"},"Elderly",{"$nulls":11},"Eligible"]
[]
[null,"Determine with documentation such as:",{"$nulls":11},{"$f":"MENU!L100","v":0},"Not categorically eligible",{"$nulls":10},{"$f":"MENU!L104","v":0},"Eligible and On Waiting List"]
[]
[null,null,"Social Security award letter",{"$nulls":22},{"$f":"MENU!L113","v":0},"Not Eligible "]
[]
[null,null,"Pay stub from previous month",{"$nulls":21},"Determination Date",{"$nulls":5},{"$f":"MENU!L105","v":"2023-12-08"}]
[]
[null,null,"Income tax return",{"$nulls":21},"Date of Initial Visit",{"$nulls":5},{"$f":"MENU!L106","v":"2023-12-08"}]
[]
[null,null,"Bank statement",{"$nulls":21},"Certification Period"]
{"$rows_left_out":20}
{"sheet":"Bar Code","index":4,"n_rows":40,"n_cols":66,"rows_kept":40,"merged":[[1,5,1,31],[2,5,2,31],[3,5,3,31],[4,5,4,31],[9,18,9,22],[11,18,11,20],[13,13,17,23],[18,13,18,23],[20,5,20,31],[21,5,21,31],[22,5,22,31],[23,5,23,31],[24,5,24,31],[25,5,25,31],[26,5,26,31],[27,5,27,31],[28,5,28,31],[29,5,29,31],[30,5,30,31],[31,5,31,31],[32,5,32,31],[33,5,33,31],[34,5,34,31],[35,5,35,31],[37,5,37,31],[38,5,38,31]]}
[]
[{"$nulls":64},"*","*"]
[{"$nulls":5},"South Texas Food Bank"]
[{"$nulls":5},"CSFP Program"]
[{"$nulls":5},"Participant's Temporary ID"]
[]
[{"$nulls":16},"Last Name:",null,{"$f":"'Pegue aqui la DB'!B2","v":"Sample"}]
[{"$nulls":16},"First Name:",null,{"$f":"'Pegue aqui la DB'!C2","v":"John"}]
[{"$nulls":16},"Middle Name:",null,{"$f":"'Pegue aqui la DB'!D2","v":"Fitzgerald"}]
[{"$nulls":16},"DOB:",null,{"$f":"'Pegue aqui la DB'!F2","v":"1954-05-24"}]
[{"$nulls":16},"Site:",null,{"$f":"MENU!L41","v":"Holy Redeemer"}]
[{"$nulls":16},"Number ID:",null,{"$f":"'Pegue aqui la DB'!A2","v":50002}]
[]
[{"$nulls":13},{"$f":"CONCATENATE($BM$2,S12,$BN$2)","v":"*50002*"}]
[]
[]
[]
[]
[{"$nulls":13},{"$f":"S12","v":50002}]
[]
[{"$nulls":5},"Welcome to the CSFP Program !"]
[{"$nulls":5},"This is a temporary ID. A permanent ID will be provided as soon as it is ready."]
[{"$nulls":5},"Please show this paper along with your photo ID every time you come to pickup your food bag."]
[]
[{"$nulls":5},"Very Important !"]
[{"$nulls":5},"By instructions of the Texas Department of Agriculture (TDA),"]
[{"$nulls":5},"Photo ID is required every time you pickup your food bag."]
[{"$nulls":5},"We apologize, but we are not allowed to provide help to "]
[{"$nulls":5},"program's participants who don't show a valid ID."]
[{"$nulls":5},"Muy Importante !"]
{"$rows_left_out":11}
{"sheet":"Rights Ingles","index":5,"n_rows":0,"n_cols":0,"rows_kept":0,"hidden":true}

{"sheet":"Rights Espanol","index":6,"n_rows":0,"n_cols":0,"rows_kept":0,"hidden":true}

{"sheet":"Milk Espanol","index":7,"n_rows":54,"n_cols":1,"rows_kept":54,"hidden":true}
{"$rows_empty":53}
["  Declaratoria de No Discriminacion"]

{"sheet":"Milk Ingles","index":8,"n_rows":51,"n_cols":1,"rows_kept":51,"hidden":true}
{"$rows_empty":50}
["   Nondiscrimination Statement"]

{"sheet":"Religious English","index":9,"n_rows":47,"n_cols":9,"rows_kept":47,"hidden":true}
{"$rows_empty":46}
[{"$nulls":8},"July 2016"]

{"sheet":"Religious Espanol","index":10,"n_rows":0,"n_cols":0,"rows_kept":0,"hidden":true}

{"sheet":"Temp Ingles","index":11,"n_rows":67,"n_cols":8,"rows_kept":67,"hidden":true,"merged":[[0,0,0,11],[1,0,1,11],[2,0,2,11],[4,0,4,11],[5,0,5,11],[6,0,6,11],[7,0,7,11],[8,0,8,11],[9,0,9,11],[10,0,10,11],[13,1,13,5],[21,1,21,5],[21,7,21,10],[25,0,25,11],[26,0,26,11],[44,0,44,11],[45,0,45,11],[46,0,46,11],[48,0,48,11],[49,0,49,11],[50,0,50,11],[51,0,51,11],[52,0,52,11],[53,0,53,11],[54,0,54,11],[57,1,57,5],[65,1,65,5],[65,7,65,10],[69,0,69,11],[70,0,70,11]]}
["South Texas Food Bank"]
["C.S.F.P. Program"]
["Temporary List Placement Notification"]
[]
["I uderstand that due to the limited number of spots in this Program, I will be receiving the bag in"]
["Temporary basis. With the understanding that I will continue receiving my bag "]
["through September 30th., 2021."]
["I am also notified that I have to inform to this office, of any change in the information I provided today"]
["(telephone number, address, income, household members number, etc)"]
["no later than 10 days of the information's date change."]
["(Please report any information update to: (956) 726-3120 CSFP Department)"]
[]
[]
[null,{"$f":"Application!B7","v":"Sample, John Fitzgerald"}]
[null,"Participant's Name"]
[]
[]
[null,"x"]
[null,"Participant's Signature",{"$nulls":5},"Program Oficial's Signature"]
[]
[]
[null,{"$f":"'Pegue aqui la DB'!Q2","v":"Active"},{"$nulls":5},{"$f":"B22","v":"Active"}]
[null,"Date",{"$nulls":5},"Date"]
{"$rows_empty":21}
["South Texas Food Bank"]
["C.S.F.P. Program"]
["Temporary List Placement Notification"]
[]
["I uderstand that due to the limited number of places in this Program, I will be receiving the bag in"]
["Temporary basis. With the understanding that I will continue receiving my bag "]
{"$rows_left_out":18}
{"sheet":"Temp Espanol","index":12,"n_rows":70,"n_cols":8,"rows_kept":70,"hidden":true,"merged":[[0,0,0,11],[1,0,1,11],[2,0,2,11],[4,0,4,11],[5,0,5,11],[6,0,6,11],[7,0,7,11],[8,0,8,11],[9,0,9,11],[10,0,10,11],[11,0,11,11],[12,0,12,11],[15,1,15,5],[23,1,23,5],[23,7,23,10],[45,0,45,11],[46,0,46,11],[47,0,47,11],[49,0,49,11],[50,0,50,11],[51,0,51,11],[52,0,52,11],[53,0,53,11],[54,0,54,11],[55,0,55,11],[56,0,56,11],[57,0,57,11],[60,1,60,5],[68,1,68,5],[68,7,68,10]]}
["South Texas Food Bank"]
["Programa de C.S.F.P. "]
["Notificación de que su aplicación quedará en Forma Temporal "]
[]
["Entiendo y estoy de acuerdo de que, debido a el número limitado de lugares en este programa,"]
["mi aplicación quedará en forma temporal."]
["Con el entendimiento de que podré continuar recogiendo mi despensa "]
["hasta Septiembre 30 de 2021."]
["Tambien estoy siendo notificado de que deberé informar a esta oficina por cualquier cambio "]
["en la información proporcionada por mi el día de hoy."]
["deberé actualizar mi información dentro de los 10 dias posteriores a que cualquier cambio ocurra."]
["(e.g. número de teléfono, domicilio, cantidad de ingresos, número de miembros en la familia en mi domicilio, etc.)"]
["(Puede reportar cualquier cambio al: (956) 726-3120 Departamento de C.S.F.P.)"]
[]
[]
[null,{"$f":"Application!B7","v":"Sample, John Fitzgerald"}]
[null,"Nombre de Participante "]
[]
[]
[null,"x"]
[null,"Firma de Participante ",{"$nulls":5},"Firma del oficial del Programa de CSFP"]
[]
[]
[null,{"$f":"'Pegue aqui la DB'!Q2","v":"Active"},{"$nulls":5},{"$f":"B24","v":"Active"}]
[null,"Fecha",{"$nulls":5},"Fecha"]
{"$rows_empty":20}
["South Texas Food Bank"]
["Programa de C.S.F.P. "]
["Notificación de que su aplicación quedará en Forma Temporal "]
[]
{"$rows_left_out":22}
{"sheet":"Form H1509","index":13,"n_rows":138,"n_cols":57,"rows_kept":138,"hidden":true,"merged":[[0,28,0,32],[1,1,1,39],[2,1,2,39],[3,1,3,39],[6,33,6,39],[9,25,9,34],[12,15,12,24],[14,10,14,39],[15,11,15,38],[16,11,16,38],[16,42,16,44],[17,11,17,38],[18,11,18,38],[19,42,19,44],[21,1,21,39],[22,1,22,39],[23,1,23,3],[25,1,25,3],[29,1,29,3],[33,1,33,3],[33,14,33,16],[33,29,33,32],[52,33,52,39],[55,25,55,34]]}
[{"$nulls":28},{"$f":"'Pegue aqui la DB'!A2","v":50002}]
[null,"Commodity Supplemental Food Program"]
[null,"Temporary Certification"]
[null,"You have been certified to receive food through the Commodity Supplemental Food Program on a temporary basis."]
["Participant Information"]
[null,"Name",{"$nulls":14},"      Address/Dirección","Signature",{"$nulls":14},"Date"]
[null,{"$f":"MENU!L37&\", \"&MENU!L38&\" \"&MENU!L39","v":"Sample, John Fitzgerald"},{"$nulls":15},"X",{"$nulls":15},{"$f":"'Pegue aqui la DB'!Q2","v":"Active"}]
[]
[null,"Address",{"$nulls":23},"Area Code and phone number",{"$nulls":9},"ZIP code"]
[null,{"$f":"MENU!L44&\", \"&MENU!L46&\", \"&MENU!L47&\" \"&MENU!L48","v":"123 Main St., Laredo, TX 78041"},{"$nulls":23},{"$f":"MENU!L50","v":"9564800492"}]
[]
[]
[{"$nulls":9},{"$f":"MENU!L111","v":"Annette Calderon"},{"$nulls":5},{"$f":"'Pegue aqui la DB'!Z2","v":""}]
[]
["Certification Dates",{"$nulls":9},{"$f":"MENU!L65","v":0}]
[{"$nulls":9},"Your certification begins on",null,{"$f":"'Pegue aqui la DB'!Q2","v":"Active"}]
[{"$nulls":11},"Date"]
[{"$nulls":9},"and ends on",null,"2021-09-30"]
[{"$nulls":11},"Date"]
[null,"At that time, you might 1) receive a temporary certification extension, 2) be certified for a period not to exceed three (3) "]
[null,"years, or 3) be placed back on the wait list."]
[null,"If you disagree with this determination, you have the right to an appeal."]
[null,"Inform the food bank or site that you want to appeal."]
[]
[{"$nulls":51},"mas ","un año","menos"]
[{"$nulls":50},"today","11 mese","despues",12]
[{"$nulls":50},{"$f":"MONTH(L16)","v":{"$error":"#VALUE!"}},11,{"$f":"AZ27+AY27","v":{"$error":"#VALUE!"}},12,{"$f":"IF(BA27-BB27<=0,12,BA27-BB27)","v":{"$error":"#VALUE!"}},1,{"$f":"IF(AY27=1,YEAR(L16)+2,YEAR(L16)+3)","v":{"$error":"#VALUE!"}}]
{"$rows_empty":23}
[null,"CE or Site Information"]
[null,"Name",{"$nulls":14},"      Address/Dirección","Signature",{"$nulls":14},"Date"]
{"$rows_left_out":38}
{"sheet":"WL Ingles","index":14,"n_rows":66,"n_cols":8,"rows_kept":66,"hidden":true,"merged":[[0,0,0,11],[1,0,1,11],[2,0,2,11],[4,0,4,11],[5,0,5,11],[7,0,7,11],[8,0,8,11],[9,0,9,11],[10,0,10,11],[13,1,13,5],[21,1,21,5],[21,7,21,10],[25,0,25,11],[26,0,26,11],[43,0,43,11],[44,0,44,11],[45,0,45,11],[47,0,47,11],[48,0,48,11],[50,0,50,11],[51,0,51,11],[52,0,52,11],[53,0,53,11],[56,1,56,5],[64,1,64,5],[64,7,64,10],[68,0,68,11],[69,0,69,11]]}
["South Texas Food Bank"]
["C.S.F.P. Program"]
["Waiting List Placement Notification"]
[]
["I uderstand that due to the limited number of spots in this Program, I will be included in a"]
["Waiting List, until a place is available for me."]
[]
["I am also notified that I have to inform to this office, of any change in the information I provided today"]
["(telephone number, address, income, household members number, etc)"]
["no later than 10 days of the information's date change."]
["(Please report any information update to: (956) 726-3120 CSFP Department)"]
[]
[]
[null,{"$f":"Application!B7","v":"Sample, John Fitzgerald"}]
[null,"Participant's Name"]
[]
[]
[null,"x"]
[null,"Participant's Signature",{"$nulls":5},"Program Oficial's Signature"]
[]
[]
[null,{"$f":"'Pegue aqui la DB'!Q2","v":"Active"},{"$nulls":5},{"$f":"B22","v":"Active"}]
[null,"Date",{"$nulls":5},"Date"]
{"$rows_empty":20}
["South Texas Food Bank"]
["C.S.F.P. Program"]
["Waiting List Placement Notification"]
[]
["I uderstand that due to the limited number of places in this Program, I will be included in a"]
["Waiting List, until a place is available for me."]
{"$rows_left_out":18}
{"sheet":"WL Espanol","index":15,"n_rows":70,"n_cols":8,"rows_kept":70,"hidden":true,"merged":[[0,0,0,11],[1,0,1,11],[3,0,3,11],[5,0,5,11],[6,0,6,11],[8,0,8,11],[9,0,9,11],[10,0,10,11],[11,0,11,11],[12,0,12,11],[15,1,15,5],[23,1,23,5],[23,7,23,10],[45,0,45,11],[46,0,46,11],[48,0,48,11],[50,0,50,11],[51,0,51,11],[53,0,53,11],[54,0,54,11],[55,0,55,11],[56,0,56,11],[57,0,57,11],[60,1,60,5],[68,1,68,5],[68,7,68,10]]}
["South Texas Food Bank"]
["C.S.F.P. Program"]
[]
["Notificación de que su aplicación quedará en Lista de Espera"]
[]
["Entiendo y estoy de acuerdo de que, debido a el limitado número de lugares en este programa,"]
["mi aplicación sera incluida en una Lista de Espera, hasta que un lugar este disponible para mi."]
[]
["También estoy siendo notificado de que deberé informar a esta oficina por cualquier cambio"]
["en la información proporcionada por mi el dia de hoy."]
["Debere actualizar mi información dentro de los 10 dias posteriores a que cualquier cambio ocurra."]
["(número de télefono, domicilio, cantidad de ingresos, número de miembros de la familia en mi domicilio, etc)"]
["(Puede reportar cualquier cambio al : (956) 726-3120 Departamento de CSFP)"]
[]
[]
[null,{"$f":"'WL Ingles'!B14:F14","v":"Sample, John Fitzgerald"}]
[null,"Nombre del Participante"]
[]
[]
[null,"x"]
[null,"Firma del Participante",{"$nulls":5},"Firma del oficial del programa de CSFP"]
[]
[]
[null,{"$f":"'WL Ingles'!B22:F22","v":"Active"},{"$nulls":5},{"$f":"B24","v":"Active"}]
[null,"Fecha",{"$nulls":5},"Fecha"]
{"$rows_empty":20}
["South Texas Food Bank"]
["C.S.F.P. Program"]
[]
["Notificación de que su aplicación quedará en Lista de Espera"]
{"$rows_left_out":22}
{"sheet":"VOUCHER","index":16,"n_rows":28,"n_cols":15,"rows_kept":28,"merged":[[2,14,3,18],[4,1,4,19],[5,1,5,19],[6,1,6,19],[8,1,8,19],[9,1,9,19],[11,1,11,19],[12,5,12,9],[12,11,12,15],[13,1,13,19],[15,7,15,9],[18,7,18,12],[27,6,27,14]]}
[]
[]
[{"$nulls":14},"1 BAG"]
[]
[null,"South Texas Food Bank"]
[null,"CSFP"]
[null,"Commodity Supplemental Food Program"]
[]
[null,"Please show a valid ID and give this paper"]
[null,"to the STFB Warehouse personnel in order to pickup your food."]
[]
[null,"This document is valid only for today."]
[{"$nulls":5},{"$f":"TODAY()","v":"2023-12-08"},{"$nulls":5},{"$f":"NOW()","v":45268.38094594907}]
[null,"This document expires one hour after its expedition."]
[]
[{"$nulls":6},"Number:",{"$f":"'Pegue aqui la DB'!A2","v":50002}]
[{"$nulls":6},"Last Name:",{"$f":"'Pegue aqui la DB'!B2","v":"Sample"}]
[{"$nulls":6},"First Name:",{"$f":"'Pegue aqui la DB'!C2","v":"John"}]
[{"$nulls":6},"DOB:",{"$f":"'Pegue aqui la DB'!F2","v":"1954-05-24"}]
[{"$nulls":6},"Address:",{"$f":"'Pegue aqui la DB'!G2","v":"123 Main St."}]
{"$rows_empty":7}
[{"$nulls":6},"Staff's Signature"]

{"sheet":"Veteran-Disabled","index":17,"n_rows":16,"n_cols":7,"rows_kept":16,"hidden":true,"merged":[[0,0,0,7],[1,0,1,7],[2,0,2,7],[11,0,11,7]]}
["South Texas Food Bank"]
["C.S.F.P. Program"]
[]
[]
[]
[null,null,"Number",null,null,{"$f":"'Pegue aqui la DB'!A2","v":50002}]
[null,null,"Name",null,null,{"$f":"Application!B7","v":"Sample, John Fitzgerald"}]
[null,null,"DOB",null,null,{"$f":"MENU!L42","v":"1954-05-24"}]
[null,null,"Site",null,null,{"$f":"MENU!L41","v":"Holy Redeemer"}]
[null,null,"Today's Date",null,null,{"$f":"'Pegue aqui la DB'!Q2","v":"Active"}]
[]
["Participant's Additional Infofrmation"]
[]
[null,null,"Is the Participant a Veteran?",{"$nulls":3},{"$f":"'Pegue aqui la DB'!AC2","v":"No"}]
[]
[null,null,"Is the Participant Disabled?",{"$nulls":3},{"$f":"'Pegue aqui la DB'!AD2","v":"No"}]

{"sheet":"Instructions","index":18,"n_rows":0,"n_cols":0,"rows_kept":0,"hidden":true}

{"sheet":"Sites","index":19,"n_rows":81,"n_cols":3,"rows_kept":81,"hidden":true}
["Site_Number","Site_Name","Site_Number_B"]
["2","Nuestra Gente ADC","2"]
["4","Villa San Luis","4"]
["6","Father Ed Kircher","6"]
["7","Las Flores ADC","7"]
["8","Tanis Valdez Village","8"]
["9","Santa Teresita Community Center","9"]
["13","Buenos Dias ADC","13"]
["14","Lulac Haven","14"]
["15","Hamilton Senior Citizen Home","15"]
["16","Guadalupe Housing","16"]
["17","Rio Bravo Community Center","17"]
["18","San Vicente de Paul Church","18"]
["19","San Martin de Porres Church","19"]
["20","Larga Vista Community Center","20"]
["21","El Cenizo Community Center","21"]
["23","Fiesta ADC","23"]
["30","Senior Citizen Home","30"]
["36","South Texas Food Bank","36"]
["38","Mirando E.J. Salinas Comm. Center","38"]
["39","Bruni Community Center","39"]
["43","Mission Santo Nino","43"]
["44","Christ Church Episcopal","44"]
["45","Lilia Perez Community Center","45"]
["49","La Hacienda ADC","49"]
["56","Laredo Manor Apartments","56"]
["58","Civic Center","58"]
["59","San Jose Church","59"]
["60","El Paraiso ADC","60"]
["64","Santa Margarita de Escocia Church","64"]
{"$rows_left_out":51}