{"text_format":"3","workbook":"xlsx","n_sheets":21,"sheets":["Attach here data","MENU","Sites","Front","Back","Rights Eng","Rights Spa","Milk Eng","Milk Spa","Written Notice Eng","Written Notice Spa","Proxy","Temp Eng","Temp Spa","Form H1509","WL Eng","WL Spa","Bar Code","VOUCHER","Veteran-Disabled","Instructions"],"not_rendered":{"images":44,"macros":1,"defined_names":24},"read":"whole","date_system":"1900"}

{"sheet":"Attach here data","index":0,"n_rows":2,"n_cols":33,"rows_kept":2}
["Client No.","Last Name","First Name","Middle Name","Site Name","DOB","Address","Apt  or Unit","Zip Code","City","State","County","Phone","Gender","Household Members","Monthly Income","Client Status","Certification Start Date","Certification End Date","Ethnicity","Race","Income Eligibility","Proxy 1","Proxy Phone","Proxy 2","Notes","Veteran","Disabled","Receive Texts","Home Delivery","Check to order a Card","Modified Date","Modified By"]
[50003,"Sample","Sample","S","163","1960-02-02","123 Main","Lot 602","78041","Laredo","TX","Webb","9567263120","Male",{"v":5,"d":"5.00"},{"v":1200,"d":"$1,200.00"},"Active","2022-05-10","2023-04-30","Hispanic or Latino","White","Social Security","Proxy Sample","9567263120","Proxy Sample 2","","No","Yes Other","Yes","Yes",0,"2022-05-10","Juan Solis"]

{"sheet":"MENU","index":1,"n_rows":150,"n_cols":21,"rows_kept":150,"merged":[[0,1,0,19],[1,1,1,19],[4,0,4,19],[13,8,13,9],[36,11,36,16],[37,11,37,16],[39,11,39,18],[40,11,40,18],[41,11,41,18],[43,11,43,18],[44,11,44,12],[44,13,44,18],[46,11,46,19],[47,11,47,19],[48,11,48,19],[49,11,49,13],[51,11,51,13],[52,11,52,13],[55,11,55,12],[56,11,56,12],[57,11,57,12],[66,11,66,18],[67,11,67,12],[104,12,104,17],[106,11,106,12],[107,11,107,12],[108,11,108,12],[108,13,108,14],[108,15,108,16],[111,11,111,18],[112,11,112,18]]}
[null,"South Texas Food Bank",{"$nulls":18}," "]
[null,"Commodity Supplemental Food Program (CSFP)"]
[]
[]
["PRINTING MENU"]
[null," "]
{"$rows_empty":7}
[{"$nulls":7},"DOB:",{"$f":"L45","v":"1960-02-02"},null,null,{"$f":"N45","v":"Age is Ok"}]
{"$rows_empty":21}
[null,"Household Information "]
[null,"Name of Individual that is Filling the Application",{"$nulls":9},{"$f":"'Attach here data'!AF2","v":44691}]
[null,"Title of Individual that is Filling the Application",{"$nulls":9},"Eligibility Specialist"]
[]
[null,"Name of Applicant",{"$nulls":7},"Last",null,{"$f":"'Attach here data'!B2","v":"Sample"}]
[{"$nulls":9},"First",null,{"$f":"'Attach here data'!C2","v":"Sample"}]
[{"$nulls":9},"(Full) Middle",null,{"$f":"'Attach here data'!D2","v":"S"}]
[]
[null,"Site Name",{"$nulls":9},{"$f":"VLOOKUP('Attach here data'!E2,Sites!A1:B100,2,FALSE)","v":"Holy Redeemer"}]
[null,"Date of Birth",{"$nulls":9},{"$f":"'Attach here data'!F2","v":"1960-02-02"},null,{"$f":"IF(L45<1,\"\",IF(L107-L45>=21915,\"Age is Ok\",\"Warning not 60 years old yet !\"))","v":"Age is Ok"}]
[]
{"$rows_left_out":86}
{"sheet":"Sites","index":2,"n_rows":78,"n_cols":3,"rows_kept":78,"hidden":true}
["Site_Number","Site_Name","Site_Number_B"]
["2","Nuestra Gente ADC","2"]
["4","Villa San Luis","4"]
["6","Father Ed Kircher","6"]
["7","Las Flores ADC","7"]
["8","Tanis Valdez Village","8"]
["9","Santa Teresita Community Center","9"]
["13","Buenos Dias ADC","13"]
["14","Lulac Haven","14"]
["15","Hamilton Senior Citizen Home","15"]
["16","Guadalupe Housing","16"]
["17","Rio Bravo Community Center","17"]
["18","San Vicente de Paul Church","18"]
["19","San Martin de Porres Church","19"]
["20","Larga Vista Community Center","20"]
["21","El Cenizo Community Center","21"]
["23","Fiesta ADC","23"]
["30","Senior Citizen Home","30"]
["36","South Texas Food Bank","36"]
["38","Mirando E.J. Salinas Comm. Center","38"]
{"$rows_left_out":59}
{"sheet":"Front","index":3,"n_rows":34,"n_cols":57,"rows_kept":34,"merged":[[0,28,0,32],[1,1,1,39],[2,1,2,39],[3,1,3,39],[5,34,5,38],[6,33,6,39],[9,1,9,6],[9,13,9,22],[9,24,9,37],[12,15,12,24],[12,25,12,29],[12,30,12,35],[14,10,14,39],[17,15,17,17],[18,14,18,18],[18,33,18,34],[19,1,19,3],[23,1,23,3],[25,21,25,26],[25,29,25,36],[26,1,26,3],[29,1,29,3],[33,1,33,3],[33,14,33,16],[33,29,33,32]]}
[{"$nulls":28},{"$f":"'Attach here data'!A2","v":50003}]
[null,"Commodity Supplemental Food Program"]
[null,"Participant Application"]
[null,"Print pages 1 – 2 for Certification."]
["Household Information"]
[null,"Name of applicant/Nombre del solicitante",{"$nulls":14},"      Address/Dirección",{"$nulls":17},"Date/Fecha"]
[null,{"$f":"'Attach here data'!B2&\", \"&'Attach here data'!C2&\" \"&'Attach here data'!D2","v":"Sample, Sample S"},{"$nulls":10},{"$f":"'Attach here data'!G2&\" \"&'Attach here data'!H2&\", \"&'Attach here data'!J2&\" \"&'Attach here data'!K2&\" \"&'Attach here data'!I2","v":"123 Main Lot 602, Laredo TX 78041"},{"$nulls":20},{"$f":"'Attach here data'!AF2","v":"2022-05-10"}]
[]
[null,"Date of birth/La fecha de nacimiento",{"$nulls":10},"     Phone number/Número de teléfono",{"$nulls":11},"    Site name/Nombre del sitio"]
[null,{"$f":"'Attach here data'!F2","v":"1960-02-02"},{"$nulls":11},{"$f":"'Attach here data'!M2","v":"9567263120"},{"$nulls":10},{"$f":"MENU!L44","v":"Holy Redeemer"}]
[]
[null,"Name of proxy/Nombre del proxy",{"$nulls":10},"     Phone number/Número de teléfono",{"$nulls":11},"    Dates of proxy/Fechas de proxy"]
[null,{"$f":"'Attach here data'!W2","v":"Proxy Sample"},{"$nulls":6},"/",{"$f":"'Attach here data'!Y2","v":"Proxy Sample 2"},{"$nulls":5},{"$f":"'Attach here data'!X2","v":"9567263120"},{"$nulls":9},{"$f":"IF(B13<=\" \",\" \",V26)","v":"2022-05-10"},{"$nulls":4},{"$f":"IF(B13<=\" \",\" \",AD26)","v":"2025-04-01"}]
[]
["Income Information",{"$nulls":9},{"$f":"MENU!L67","v":0}]
[null,"Total gross income (before deductions) of all household members. SNAP benefits do not count as income."]
[null,"Ingreso brutos total (antes de deducciones) de todos los miembros del hogar. Beneficios de SNAP no cuentan como ingreso."]
[null,"$_________    Weekly/Semanal",{"$nulls":12},"$",{"$f":"IF('Attach here data'!P2<=0,\" \",'Attach here data'!P2)","v":{"v":1200,"d":"1,200"}},null,null,"  Monthly/Mensual",{"$nulls":7},"  $_________    Yearly/Anual"]
[{"$nulls":14},{"$f":"IF(MENU!L56<=0,\" \",MENU!L56)","v":" "},{"$nulls":18},{"$f":"IF(MENU!L58<=0,\" \",MENU!L58)","v":" "}]
[null,{"$f":"'Attach here data'!O2","v":5},null,null,"Number of household members/Número de miembros del hogar"]
{"$rows_left_out":15}
{"sheet":"Back","index":4,"n_rows":44,"n_cols":30,"rows_kept":44,"merged":[[0,1,0,3],[11,12,11,13],[11,29,11,30],[14,2,14,3],[15,2,15,3],[16,2,16,3],[17,2,17,3],[18,2,18,3]]}
[null,{"$f":"Front!AC1","v":50003},null,null,{"$f":"Front!B7","v":"Sample, Sample S"}]
{"$rows_empty":8}
["Ethnicity and Race"]
[null,"Ethnicity  (select one category)/Origen étnico (seleccione una categoría)"]
[null,null," Hispanic or Latino/Hispano o Latino",{"$nulls":9},{"$f":"MENU!L78","v":"X"},{"$nulls":4},"Not Hispanic or Latino/No hispano o Latino",{"$nulls":11},{"$f":"MENU!L79","v":0}]
[]
[null,"Race  (select one or more categories)/Raza (seleccione una o más categorías)"]
[null,null,{"$f":"MENU!L71","v":0},null,"Black or African American/Negro o afroamericano"]
[null,null,{"$f":"MENU!L72","v":0},null,"Native Hawaiian or Other Pacific Islander/Nativo de Hawai o de otra isla del Pacífico"]
[null,null,{"$f":"MENU!L73","v":0},null,"American Indian or Alaskan Native/Indio americano o nativo de Alaska"]
[null,null,{"$f":"MENU!L74","v":0},null,"Asian/asiático"]
[null,null,{"$f":"MENU!L75","v":"X"},null,"White/el blanco"]
{"$rows_empty":22}
["Signatures"]
[null,"  Applicant or Proxy’s Signature/Firma del participante o representante",{"$nulls":17},"   CE or Site’s Signature/CE o firma del sitio"]
[null,"X",{"$nulls":18},{"$f":"'Attach here data'!AG2","v":"Juan Solis"}]

{"sheet":"Rights Eng","index":5,"n_rows":0,"n_cols":0,"rows_kept":0}

{"sheet":"Rights Spa","index":6,"n_rows":0,"n_cols":0,"rows_kept":0}

{"sheet":"Milk Eng","index":7,"n_rows":51,"n_cols":1,"rows_kept":51}
{"$rows_empty":50}
["   Nondiscrimination Statement"]

{"sheet":"Milk Spa","index":8,"n_rows":54,"n_cols":1,"rows_kept":54}
{"$rows_empty":53}
["  Declaratoria de No Discriminacion"]

{"sheet":"Written Notice Eng","index":9,"n_rows":47,"n_cols":9,"rows_kept":47,"hidden":true}
{"$rows_empty":46}
[{"$nulls":8},"July 2016"]

{"sheet":"Written Notice Spa","index":10,"n_rows":0,"n_cols":0,"rows_kept":0,"hidden":true}

{"sheet":"Proxy","index":11,"n_rows":28,"n_cols":39,"rows_kept":28,"merged":[[0,1,0,7],[0,15,0,26],[0,31,0,33],[0,38,0,40],[1,15,1,26],[1,38,1,40],[2,1,2,20],[2,21,2,40],[3,21,3,34],[5,1,5,3],[6,1,6,3],[6,18,6,31],[6,32,6,39],[7,5,7,17],[7,32,7,39],[8,8,8,9],[8,15,8,19],[8,21,8,25],[9,2,9,13],[9,15,9,25],[9,27,9,39],[11,1,11,3],[12,1,12,3],[12,18,12,31],[12,32,12,39],[13,5,13,17],[13,32,13,39],[14,5,14,6],[14,8,14,9],[14,15,14,19],[14,21,14,25],[15,2,15,13],[15,15,15,25],[15,27,15,39],[17,1,17,3],[18,1,18,3],[18,18,18,31],[19,5,19,17],[19,32,19,39],[20,2,20,3],[20,5,20,6],[20,8,20,9],[21,2,21,13],[21,15,21,25],[21,27,21,39],[23,1,23,3],[24,1,24,3],[24,18,24,31],[25,5,25,17],[25,32,25,39],[26,2,26,3],[26,5,26,6],[26,8,26,9],[27,2,27,13],[27,15,27,25],[27,27,27,39]]}
[null,"Texas Department of Agriculture",{"$nulls":13},"Commodity Supplemental Food Program",{"$nulls":15},{"$f":"'Attach here data'!A2","v":50003},{"$nulls":6},"July 2022"]
[{"$nulls":15},"Proxy Form",{"$nulls":22},"FD 099-2016"]
[null," Participant’s name (print) / Nombre del solicitante      ",{"$nulls":19}," Name of distribution site / Nombre del sitio de la distribución      "]
[null,{"$f":"'Attach here data'!B2&\", \"&'Attach here data'!C2&\" \"&'Attach here data'!D2","v":"Sample, Sample S"},{"$nulls":19},{"$f":"MENU!L44","v":"Holy Redeemer"}]
[]
[null," I authorize / ",{"$nulls":7},"     "]
[null," Autorizo",{"$nulls":3},{"$f":"'Attach here data'!W2","v":"Proxy Sample"},{"$nulls":12},"to be my proxy in the CSFP. / que me representante en la CSFP.",{"$nulls":13},{"$f":"IF('Attach here data'!W2<=\" \",\" \",Front!AH7)","v":"2022-05-10"}]
[{"$nulls":5},"  Proxy’s name (print) / Nombre del representante",{"$nulls":26},"Today’s date / Fecha de hoy"]
[null,null,{"$f":"IF('Attach here data'!W2<=\" \",\" \",\"X\")","v":"X"},null,null,"     ",null,null,"     ",{"$nulls":6},{"$f":"IF('Attach here data'!W2<=\" \",\" \",Front!Z13)","v":"2022-05-10"},{"$nulls":4},{"$f":"IF('Attach here data'!W2<=\" \",\" \",\"to\")","v":"to"},{"$f":"IF('Attach here data'!W2<=\" \",\" \",Front!AE13)","v":"2025-04-01"}]
[null,null,"   Participant’s signature / Firma del participante",{"$nulls":12},"   Duration of proxy / Duración de representante",{"$nulls":11},"   CE or site’s signature / Firma del CE o sitio"]
[]
[null," I authorize / ",{"$nulls":7},"     "]
[null," Autorizo",{"$nulls":3},{"$f":"'Attach here data'!Y2","v":"Proxy Sample 2"},{"$nulls":12},"to be my proxy in the CSFP. / que me representante en la CSFP.",{"$nulls":13},{"$f":"IF('Attach here data'!Y2<=\" \",\" \",Front!AH7)","v":"2022-05-10"}]
[{"$nulls":5},"  Proxy’s name (print) / Nombre del representante",{"$nulls":26},"Today’s date / Fecha de hoy"]
[null,null,{"$f":"IF('Attach here data'!Y2<=\" \",\" \",\"X\")","v":"X"},null,null,"     ",null,null,"     ",{"$nulls":6},{"$f":"IF('Attach here data'!Y2<=\" \",\" \",Front!Z13)","v":"2022-05-10"},{"$nulls":4},{"$f":"IF('Attach here data'!Y2<=\" \",\" \",\"to\")","v":"to"},{"$f":"IF('Attach here data'!Y2<=\" \",\" \",Front!AE13)","v":"2025-04-01"}]
[null,null,"   Participant’s signature / Firma del participante",{"$nulls":12},"   Duration of proxy / Duración de representante",{"$nulls":11},"   CE or site’s signature / Firma del CE o sitio"]
[]
[null," I authorize / ",{"$nulls":7},"     "]
[null," Autorizo",{"$nulls":16},"to be my proxy in the CSFP. / que me representante en la CSFP."]
[{"$nulls":5},"  Proxy’s name (print) / Nombre del representante",{"$nulls":26},"Today’s date / Fecha de hoy"]
{"$rows_left_out":9}
{"sheet":"Temp Eng","index":12,"n_rows":65,"n_cols":8,"rows_kept":65,"merged":[[0,0,0,11],[1,0,1,11],[2,0,2,11],[4,0,4,11],[5,0,5,11],[6,0,6,11],[7,0,7,11],[8,0,8,11],[9,0,9,11],[10,0,10,11],[13,1,13,5],[21,1,21,5],[21,7,21,10],[25,0,25,11],[26,0,26,11],[42,0,42,11],[43,0,43,11],[44,0,44,11],[46,0,46,11],[47,0,47,11],[48,0,48,11],[49,0,49,11],[50,0,50,11],[51,0,51,11],[52,0,52,11],[55,1,55,5],[63,1,63,5],[63,7,63,10],[67,0,67,11],[68,0,68,11]]}
["South Texas Food Bank"]
["C.S.F.P. Program"]
["Temporary List Placement Notification"]
[]
["I uderstand that due to the limited number of spots in this Program, I will be receiving the bag in"]
["Temporary basis. With the understanding that this benefit will end in "]
[{"$f":"'Temp Spa'!A8:L8","v":"2023-02-28"}]
["At that time I might 1)receive a temporary certification extension, 2) be certified for a period not to"]
["exceed three (3) years, or 3) be placed back on the wait list."]
[]
["(Please report any information update to: (956) 726-3120 CSFP Department)"]
[]
[]
[null,{"$f":"Front!B7","v":"Sample, Sample S"}]
[null,"Participant's Name"]
[]
[]
[null,"x"]
[null,"Participant's Signature",{"$nulls":5},"Program Oficial's Signature"]
[]
{"$rows_left_out":28}
{"sheet":"Temp Spa","index":13,"n_rows":70,"n_cols":8,"rows_kept":70,"merged":[[0,0,0,11],[1,0,1,11],[2,0,2,11],[4,0,4,11],[5,0,5,11],[6,0,6,11],[7,0,7,11],[8,0,8,11],[9,0,9,11],[10,0,10,11],[11,0,11,11],[12,0,12,11],[15,1,15,5],[23,1,23,5],[23,7,23,10],[45,0,45,11],[46,0,46,11],[47,0,47,11],[49,0,49,11],[50,0,50,11],[51,0,51,11],[52,0,52,11],[53,0,53,11],[54,0,54,11],[55,0,55,11],[56,0,56,11],[57,0,57,11],[60,1,60,5],[68,1,68,5],[68,7,68,10]]}
["South Texas Food Bank"]
["Programa de C.S.F.P. "]
["Notificación de que su aplicación quedará en Forma Temporal "]
[]
["Entiendo y estoy de acuerdo de que, debido a el número limitado de lugares en este programa,"]
["mi aplicación quedará en forma temporal."]
["Con el entendimiento de que este beneficio terminará en"]
[{"$f":"'Form H1509'!L18","v":"2023-02-28"}]
["En esa fecha yo podre 1) recibir una extension del beneficio, 2) ser certificado por un periodo que no"]
["excedera tres (3) años, o 3) ser puedto de nuevo en lista de espera."]
[]
["(Puede reportar cualquier cambio al: (956) 726-3120 Departamento de C.S.F.P.)"]
[]
[]
[]
[null,{"$f":"Front!B7","v":"Sample, Sample S"}]
[null,"Nombre de Participante "]
[]
[]
[null,"x"]
{"$rows_left_out":32}
{"sheet":"Form H1509","index":14,"n_rows":140,"n_cols":57,"rows_kept":140,"merged":[[0,28,0,32],[1,1,1,39],[2,1,2,39],[3,1,3,39],[6,33,6,39],[9,25,9,34],[9,36,9,39],[12,15,12,24],[14,10,14,39],[15,11,15,38],[16,11,16,38],[16,42,16,44],[17,11,17,38],[18,11,18,38],[19,42,19,44],[21,1,21,39],[22,1,22,39],[23,1,23,3],[25,1,25,3],[29,1,29,3],[33,1,33,3],[33,14,33,16],[33,29,33,32],[54,33,54,39],[57,25,57,34]]}
[{"$nulls":28},{"$f":"'Attach here data'!A2","v":50003}]
[null,"Commodity Supplemental Food Program"]
[null,"Temporary Certification"]
[null,"You have been certified to receive food through the Commodity Supplemental Food Program on a temporary basis."]
["Participant Information"]
[null,"Name",{"$nulls":14},"      Address/Dirección","Signature",{"$nulls":14},"Date"]
[null,{"$f":"MENU!L40&\", \"&MENU!L41&\" \"&MENU!L42","v":"Sample, Sample S"},{"$nulls":15},"X",{"$nulls":15},{"$f":"'Attach here data'!R2","v":"2022-05-10"}]
[]
[null,"Address",{"$nulls":23},"Area Code and phone number",{"$nulls":9},"ZIP code"]
[null,{"$f":"Front!M7","v":"123 Main Lot 602, Laredo TX 78041"},{"$nulls":23},{"$f":"'Attach here data'!M2","v":"9567263120"},{"$nulls":10},{"$f":"'Attach here data'!I2","v":"78041"}]
[]
[]
[{"$nulls":9},{"$f":"MENU!L113","v":"No"},{"$nulls":5},{"$f":"'Attach here data'!Z2","v":""}]
[]
["Certification Dates",{"$nulls":9},{"$f":"MENU!L67","v":0}]
[{"$nulls":9},"Your certification begins on",null,{"$f":"'Attach here data'!R2","v":"2022-05-10"}]
[{"$nulls":11},"Date"]
[{"$nulls":9},"and ends on",null,"2023-02-28"]
[{"$nulls":11},"Date"]
[null,"At that time, you might 1) receive a temporary certification extension, 2) be certified for a period not to exceed three (3) "]
{"$rows_left_out":48}
{"sheet":"WL Eng","index":15,"n_rows":66,"n_cols":8,"rows_kept":66,"merged":[[0,0,0,11],[1,0,1,11],[2,0,2,11],[4,0,4,11],[5,0,5,11],[7,0,7,11],[8,0,8,11],[9,0,9,11],[10,0,10,11],[13,1,13,5],[21,1,21,5],[21,7,21,10],[25,0,25,11],[26,0,26,11],[43,0,43,11],[44,0,44,11],[45,0,45,11],[47,0,47,11],[48,0,48,11],[50,0,50,11],[51,0,51,11],[52,0,52,11],[53,0,53,11],[56,1,56,5],[64,1,64,5],[64,7,64,10],[68,0,68,11],[69,0,69,11]]}
["South Texas Food Bank"]
["C.S.F.P. Program"]
["Waiting List Placement Notification"]
[]
["I uderstand that due to the limited number of spots in this Program, I will be included in a"]
["Waiting List, until a place is available for me."]
[]
["I am also notified that I have to inform to this office, of any change in the information I provided today"]
["(telephone number, address, income, household members number, etc)"]
["no later than 10 days of the information's date change."]
["(Please report any information update to: (956) 726-3120 CSFP Department)"]
[]
[]
[null,{"$f":"Front!B7","v":"Sample, Sample S"}]
[null,"Participant's Name"]
[]
[]
[null,"x"]
[null,"Participant's Signature",{"$nulls":5},"Program Oficial's Signature"]
[]
{"$rows_left_out":28}
{"sheet":"WL Spa","index":16,"n_rows":70,"n_cols":8,"rows_kept":70,"merged":[[0,0,0,11],[1,0,1,11],[3,0,3,11],[5,0,5,11],[6,0,6,11],[8,0,8,11],[9,0,9,11],[10,0,10,11],[11,0,11,11],[12,0,12,11],[15,1,15,5],[23,1,23,5],[23,7,23,10],[45,0,45,11],[46,0,46,11],[48,0,48,11],[50,0,50,11],[51,0,51,11],[53,0,53,11],[54,0,54,11],[55,0,55,11],[56,0,56,11],[57,0,57,11],[60,1,60,5],[68,1,68,5],[68,7,68,10]]}
["South Texas Food Bank"]
["C.S.F.P. Program"]
[]
["Notificación de que su aplicación quedará en Lista de Espera"]
[]
["Entiendo y estoy de acuerdo de que, debido a el limitado número de lugares en este programa,"]
["mi aplicación sera incluida en una Lista de Espera, hasta que un lugar este disponible para mi."]
[]
["También estoy siendo notificado de que deberé informar a esta oficina por cualquier cambio"]
["en la información proporcionada por mi el dia de hoy."]
["Debere actualizar mi información dentro de los 10 dias posteriores a que cualquier cambio ocurra."]
["(número de télefono, domicilio, cantidad de ingresos, número de miembros de la familia en mi domicilio, etc)"]
["(Puede reportar cualquier cambio al : (956) 726-3120 Departamento de CSFP)"]
[]
[]
[null,{"$f":"'WL Eng'!B14:F14","v":"Sample, Sample S"}]
[null,"Nombre del Participante"]
[]
[]
[null,"x"]
{"$rows_left_out":32}
{"sheet":"Bar Code","index":17,"n_rows":40,"n_cols":66,"rows_kept":40,"merged":[[1,5,1,31],[2,5,2,31],[3,5,3,31],[4,5,4,31],[9,18,9,22],[11,18,11,20],[13,13,17,23],[18,13,18,23],[20,5,20,31],[21,5,21,31],[22,5,22,31],[23,5,23,31],[24,5,24,31],[25,5,25,31],[26,5,26,31],[27,5,27,31],[28,5,28,31],[29,5,29,31],[30,5,30,31],[31,5,31,31],[32,5,32,31],[33,5,33,31],[34,5,34,31],[35,5,35,31],[37,5,37,31],[38,5,38,31]]}
[]
[{"$nulls":64},"*","*"]
[{"$nulls":5},"South Texas Food Bank"]
[{"$nulls":5},"CSFP Program"]
[{"$nulls":5},"Participant's Temporary ID"]
[]
[{"$nulls":16},"Last Name:",null,{"$f":"'Attach here data'!B2","v":"Sample"}]
[{"$nulls":16},"First Name:",null,{"$f":"'Attach here data'!C2","v":"Sample"}]
[{"$nulls":16},"Middle Name:",null,{"$f":"'Attach here data'!D2","v":"S"}]
[{"$nulls":16},"DOB:",null,{"$f":"'Attach here data'!F2","v":"1960-02-02"}]
[{"$nulls":16},"Site:",null,{"$f":"MENU!L44","v":"Holy Redeemer"}]
[{"$nulls":16},"Number ID:",null,{"$f":"'Attach here data'!A2","v":50003}]
[]
[{"$nulls":13},{"$f":"CONCATENATE($BM$2,S12,$BN$2)","v":"*50003*"}]
[]
[]
[]
[]
[{"$nulls":13},{"$f":"S12","v":50003}]
[]
{"$rows_left_out":21}
{"sheet":"VOUCHER","index":18,"n_rows":29,"n_cols":16,"rows_kept":29,"merged":[[2,15,3,19],[4,1,4,19],[5,1,5,19],[6,1,6,19],[8,1,8,19],[9,1,9,19],[11,1,11,19],[12,5,12,9],[12,11,12,15],[13,1,13,19],[15,7,15,9],[18,7,18,12],[28,6,28,14]]}
[]
[]
[{"$nulls":15},"1 BAG"]
[]
[null,"South Texas Food Bank"]
[null,"CSFP"]
[null,"Commodity Supplemental Food Program"]
[]
[null,"Please show a valid ID and give this paper"]
[null,"to the STFB Warehouse personnel in order to pickup your food."]
[]
[null,"This document is valid only for today."]
[{"$nulls":5},{"$f":"TODAY()","v":"2023-12-08"},{"$nulls":5},{"$f":"NOW()","v":45268.396841898146}]
[null,"This document expires one hour after its expedition."]
[]
[{"$nulls":6},"Number:",{"$f":"'Attach here data'!A2","v":50003}]
[{"$nulls":6},"Last Name:",{"$f":"'Attach here data'!B2","v":"Sample"}]
[{"$nulls":6},"First Name:",{"$f":"'Attach here data'!C2","v":"Sample"}]
[{"$nulls":6},"DOB:",{"$f":"'Attach here data'!F2","v":"1960-02-02"}]
[{"$nulls":6},"Address:",{"$f":"'Attach here data'!G2","v":"123 Main"}]
{"$rows_left_out":3}
{"sheet":"Veteran-Disabled","index":19,"n_rows":16,"n_cols":7,"rows_kept":16,"hidden":true,"merged":[[0,0,0,7],[1,0,1,7],[2,0,2,7],[11,0,11,7]]}
["South Texas Food Bank"]
["C.S.F.P. Program"]
[]
[]
[]
[null,null,"Number",null,null,{"$f":"'Attach here data'!A2","v":50003}]
[null,null,"Name",null,null,{"$f":"Front!B7","v":"Sample, Sample S"}]
[null,null,"DOB",null,null,{"$f":"MENU!L45","v":"1960-02-02"}]
[null,null,"Site",null,null,{"$f":"MENU!L44","v":"Holy Redeemer"}]
[null,null,"Today's Date",null,null,{"$f":"'Attach here data'!Q2","v":"Active"}]
[]
["Participant's Additional Infofrmation"]
[]
[null,null,"Is the Participant a Veteran?",{"$nulls":3},{"$f":"'Attach here data'!AC2","v":"Yes"}]
[]
[null,null,"Is the Participant Disabled?",{"$nulls":3},{"$f":"'Attach here data'!AD2","v":"Yes"}]

{"sheet":"Instructions","index":20,"n_rows":0,"n_cols":0,"rows_kept":0,"hidden":true}